{"text_format":"1","workbook":"xlsx","n_sheets":3,"sheets":["記入例","入力用","印刷用調査書"],"not_rendered":{"charts":0,"images":1,"macros":0,"external_links":0,"defined_names":1,"comments":0,"pivot_tables":0},"unopened":[],"bounds":{"document_bytes":16777216,"sheet_cells":100000,"rows_first":2000,"rows_last":500,"rows_between":2000,"halvings":0,"cell_chars":16384,"cell_head_chars":4096},"cells_cut":0,"cells_raw":0,"read":"whole","date_system":"1900"}

{"sheet":"記入例","index":0,"n_rows":0,"n_cols":0,"rows_kept":0,"cut":false,"hidden":false,"merged":[]}

{"sheet":"入力用","index":1,"n_rows":61,"n_cols":74,"rows_kept":61,"cut":false,"hidden":false,"merged":[[11,16,12,16],[11,17,12,17],[11,18,12,18],[11,19,12,19],[11,47,12,47],[11,37,11,40],[11,41,11,44],[11,45,12,45],[11,46,12,46],[11,24,11,32],[11,33,11,36],[11,21,12,21],[11,22,12,22],[11,23,12,23],[11,48,11,59],[11,60,11,66],[11,68,11,70],[11,71,11,73],[7,2,7,4],[8,2,8,4],[9,2,9,4],[11,4,12,4],[11,5,12,5],[11,13,12,13],[11,6,12,6],[11,7,11,10],[11,20,12,20],[11,14,12,14],[11,11,11,12],[11,15,12,15]]}
[]
[null,null,null,null,null,"鹿児島城西高等学校　調査書作成シート"]
[null,"調査書作成日"]
[null,"年","月","日",null,null,"※白い枠のみにデータを入力して下さい。"]
[null,null,null,null,null,null,"※学校名入力例「○○立○○中学校」「○○立○○義務教育学校」「○○立○○特別支援（養護）学校」"]
[null,null,null,null,null,null,"※文章入力時のセル内での改行については、「Ａｌｔ　＋　Ｅｎｔｅｒ」　キーを押して下さい。"]
[null,null,null,null,null,null,"※「文章で評価」および「行動の記録」の欄について，文章が入りきらなければ記入欄に「※別紙参照」と記載いただき，別紙添付してください。"]
[null,"学校名",null,null,null,null,"　別紙の書式は特に定めませんが，学校名と受験者氏名は必ず記載してください。"]
[null,"校長名"]
[null,"学級担任名"]
[null,null,null,null,1,2,3,4,5,6,7,8,9,10,11,12,13,14,15,16,17,18,19,20,21,22,23,24,25,26,27,28,29,30,31,32,33,34,35,36,37,38,39,40,41,42,43,44,45,46,47,48,49,50,51,52,53,54,55,56,57,58,59,60,61,62,63,64,65,66,67,68,69,70]
[null,null,null,null,"番号","氏名","ふりがな","生年月日",null,null,null,"入学年",null,"入学時学校名","在籍学級","国語","社会","数学","理科","音楽","美術","保健\n体育","技術\n家庭","外国\n語","記　述　で　評　価",null,null,null,null,null,null,null,null,"１年",null,null,null,"２年",null,null,null,"３年",null,null,null,"健康上の所見","特別活動の記録","特記事項","知能検査",null,null,null,null,null,null,null,null,null,null,null,"併せ有する障害",null,null,null,null,null,null,"療育手帳B2","障害者手帳",null,null,"精神福祉者手帳"]
[null,null,null,null,null,null,null,"和号","年","月","日","和号","年",null,null,null,null,null,null,null,null,null,null,null,"国語","社会","数学","理科","音楽","美術","保健体育","技術・家庭","外国語","欠席","遅刻","早退","理由","欠席","遅刻","早退","理由","欠席","遅刻","早退","理由",null,null,null,"検査名1","検査結果1","検査実施日1","検査実施場所1","検査名2","検査結果2","検査実施日2","検査実施場所2","検査名3","検査結果3","検査実施日3","検査実施場所3","情緒障害","視覚障害","聴覚障害","肢体不自由","病弱など","その他","内容","取得日","種","級","取得日","種","級","取得日"]
[null,null,null,null,0,"城西　太郎","じょうせい　たろう","平成",null,null,null,"令和",2,"薩摩川内市立　東郷学園義務教育学校","３　特別支援学級(自閉・情緒)",null,2,null,2,3,3,2,2,null,"小学校４年生程度の読み書きができる。四字熟語を覚えるのが得意である。",null,"四則計算・時間・長さなどの問題に取り組んだ。文章問題は困難である。",null,null,null,null,null,"ＡＬＴと会話をしながら簡単な英単語を覚えることができた。",10,2,2,"欠席（気分不良9・発熱1）\n遅刻（寝坊2）早退（発熱2）",3,0,0,"欠席（気分不良2・発熱1）",4,2,0,"欠席（気分不良3・腹痛1）\n遅刻（気分不良2）","てんかん発作","水泳が得意である（障害者大会で鹿児島県2位を獲得）","　保健室に登校し，気持ちを落ち着けることで教室に入ることができた。全校集会など集団行動の場面では集団に入れず後方で参加した。感情の起伏が激しく，突発的な行動を起こすことがあるが，個別に話を聞くことで通常の活動に取り組むことができる。吃音があることで，人前で話すことが苦手である。","ＷＩＳＣⅢ","ＩＱ　５０","令和2年9月2日","南城西中学校","田中ビネー",null,"令和2年8月1日","鹿児島中央児童相談所",null,null,null,null,null,null,null,null,null,"○","ＡＤＨＤ","平成28年7月1日"]
[null,null,null,null,1]
[null,null,null,null,2]
[null,null,null,null,3]
[null,null,null,null,4]
[null,null,null,null,5]
[null,null,null,null,6]
[null,null,null,null,7]
[null,null,null,null,8]
[null,null,null,null,9]
[null,null,null,null,10]
[null,null,null,null,11]
[null,null,null,null,12]
[null,null,null,null,13]
[null,null,null,null,14]
[null,null,null,null,15]
[null,null,null,null,16]
[null,null,null,null,17]
[null,null,null,null,18]
[null,null,null,null,19]
[null,null,null,null,20]
[null,null,null,null,21]
[null,null,null,null,22]
[null,null,null,null,23]
[null,null,null,null,24]
[null,null,null,null,25]
[null,null,null,null,26]
[null,null,null,null,27]
[null,null,null,null,28]
[null,null,null,null,29]
[null,null,null,null,30]
[null,null,null,null,31]
[null,null,null,null,32]
[null,null,null,null,33]
[null,null,null,null,34]
[null,null,null,null,35]
[null,null,null,null,36]
[null,null,null,null,37]
[null,null,null,null,38]
[null,null,null,null,39]
[null,null,null,null,40]
[]
[]
[]
[]
[null,null,null,null,null,null,null,null,null,null,null,null,null,null,"１　通常学級"]
[null,null,null,null,null,null,null,null,null,null,null,null,null,null,"２　特別支援学級（知的）"]
[null,null,null,null,null,null,null,null,null,null,null,null,null,null,"３　特別支援学級(自閉・情緒)"]

{"sheet":"印刷用調査書","index":2,"n_rows":110,"n_cols":84,"rows_kept":110,"cut":false,"hidden":false,"merged":[[34,72,37,79],[23,40,25,68],[96,62,98,64],[96,65,98,75],[99,65,101,75],[102,65,104,75],[34,38,37,41],[38,38,41,41],[34,51,37,71],[38,51,41,71],[89,40,90,59],[96,43,98,45],[55,46,58,48],[55,49,58,51],[55,52,58,79],[59,40,62,42],[59,43,62,45],[59,46,62,48],[59,49,62,51],[59,52,62,79],[63,60,64,79],[63,40,64,59],[96,58,98,59],[102,58,104,59],[6,83,7,122],[8,83,9,122],[11,83,15,122],[19,40,21,68],[91,60,92,79],[34,42,37,45],[38,42,41,45],[34,46,37,50],[38,46,41,50],[38,72,41,79],[30,66,33,69],[51,49,54,51],[51,52,54,79],[47,40,48,79],[49,40,50,42],[49,43,50,45],[49,46,50,48],[49,49,50,51],[49,52,50,79],[51,40,54,42],[51,43,54,45],[51,46,54,48],[55,40,58,42],[55,43,58,45],[109,0,110,29],[109,32,110,79],[89,60,90,79],[65,40,68,59],[65,60,68,79],[69,40,70,79],[71,40,86,79],[87,40,88,59],[87,60,88,79],[97,40,103,42],[99,43,101,45],[102,43,104,45],[106,77,108,79],[91,24,92,39],[91,40,92,59],[106,40,108,50],[75,15,78,39],[87,3,88,23],[87,24,88,39],[91,3,92,23],[87,0,94,2],[106,51,108,76],[99,62,101,64],[105,20,106,22],[5,0,10,6],[5,53,10,79],[11,57,12,61],[11,62,12,63],[19,30,21,39],[11,53,12,56],[5,46,10,52],[5,7,10,45],[1,83,2,84],[3,83,5,84],[0,31,3,49],[34,9,41,36],[1,50,2,78],[30,62,33,65],[11,76,12,77],[11,71,12,75],[21,72,24,75],[11,64,12,68],[11,69,12,70],[30,37,33,45],[30,46,33,49],[30,54,33,55],[30,60,33,61],[13,3,14,23],[30,50,33,53],[30,56,33,59],[30,9,33,36],[30,0,33,8],[15,3,17,7],[15,8,17,27],[27,2,29,30],[79,3,82,8],[83,3,86,8],[63,3,66,8],[67,3,70,8],[71,3,74,8],[75,9,78,14],[75,3,78,8],[34,0,41,8],[47,3,50,8],[51,3,54,8],[51,15,54,39],[47,9,50,14],[47,15,50,39],[51,9,54,14],[55,9,58,14],[55,15,58,39],[59,15,62,39],[79,9,82,14],[83,9,86,14],[67,9,70,14],[63,9,66,14],[55,3,58,8],[71,9,74,14],[59,3,62,8],[59,9,62,14],[93,3,94,23],[93,24,94,39],[89,3,90,23],[89,24,90,39],[63,15,66,39],[67,15,70,39],[71,15,74,39],[83,15,86,39],[79,15,82,39],[107,20,108,22],[93,40,94,59],[93,60,94,79],[97,20,98,22],[99,20,100,22],[95,0,108,10],[95,11,96,19],[95,20,96,39],[97,11,108,19],[107,23,108,30],[107,31,108,39],[105,23,106,39],[101,20,102,22],[103,20,104,22],[96,76,98,79],[99,76,101,79],[102,76,104,79],[42,0,46,8],[42,10,46,12],[42,13,46,30],[23,30,25,39],[99,46,101,55],[102,62,104,64],[42,32,46,34],[42,35,46,52],[42,54,46,56],[42,57,46,79],[51,0,81,2],[97,23,98,39],[99,23,100,39],[101,23,102,39],[103,23,104,39],[102,60,104,61],[102,46,104,55],[96,46,98,55],[96,60,98,61],[99,56,101,57],[99,58,101,59],[99,60,101,61],[102,56,104,57],[96,56,98,57]]}
[null,null,null,null,null,null,null,null,null,null,null,null,null,null,null,null,null,null,null,null,null,null,null,null,null,null,null,null,null,null,null,"調　査　書"]
[null,null,null,null,null,null,null,null,null,null,null,null,null,null,null,null,null,null,null,null,null,null,null,null,null,null,null,null,null,null,null,null,null,null,null,null,null,null,null,null,null,null,null,null,null,null,null,null,null,null,"(普通科　共生コース用)",null,null,null,null,null,null,null,null,null,null,null,null,null,null,null,null,null,null,null,null,null,null,null,null,null,null,null,null,null,null,null,null,"出力番号は"]
[]
[null,null,null,null,null,null,null,null,null,null,null,null,null,null,null,null,null,null,null,null,null,null,null,null,null,null,null,null,null,null,null,null,null,null,null,null,null,null,null,null,null,null,null,null,null,null,null,null,null,null,null,null,null,null,null,null,null,null,null,null,null,null,null,null,null,null,null,null,null,null,null,null,null,null,null,null,null,null,null,null,null,null,null,0]
[]
["受験学科",null,null,null,null,null,null,"普　通　科　　共生コース",null,null,null,null,null,null,null,null,null,null,null,null,null,null,null,null,null,null,null,null,null,null,null,null,null,null,null,null,null,null,null,null,null,null,null,null,null,null,"受験番号",null,null,null,null,null,null,"　※\n\n"]
[null,null,null,null,null,null,null,null,null,null,null,null,null,null,null,null,null,null,null,null,null,null,null,null,null,null,null,null,null,null,null,null,null,null,null,null,null,null,null,null,null,null,null,null,null,null,null,null,null,null,null,null,null,null,null,null,null,null,null,null,null,null,null,null,null,null,null,null,null,null,null,null,null,null,null,null,null,null,null,null,null,null,null,"※必要項目が表示されます。"]
[]
[null,null,null,null,null,null,null,null,null,null,null,null,null,null,null,null,null,null,null,null,null,null,null,null,null,null,null,null,null,null,null,null,null,null,null,null,null,null,null,null,null,null,null,null,null,null,null,null,null,null,null,null,null,null,null,null,null,null,null,null,null,null,null,null,null,null,null,null,null,null,null,null,null,null,null,null,null,null,null,null,null,null,null,"※出力したい番号を入力して、印刷を行なって下さい。"]
[]
[]
[null,null,null,null,null,null,null,null,null,null,null,null,null,null,null,null,null,null,null,null,null,null,null,null,null,null,null,null,null,null,null,null,null,null,null,null,null,null,null,null,null,null,null,null,null,null,null,null,null,null,null,null,null,"令和",null,null,null,{"$f":"IF($CF$4=\"\",\"\",入力用!$B$5)","v":0},null,null,null,null,"年",null,{"$f":"IF($CF$4=\"\",\"\",入力用!$C$5)","v":0},null,null,null,null,"月",null,{"$f":"IF($CF$4=\"\",\"\",入力用!$D$5)","v":0},null,null,null,null,"日",null,null,null,null,null,null,"※関数保護のためシートに保護をかけてありますが，「校閲」の「シート保護の解除」で解除できます。（パスワードは必要ありません）"]
[]
[null,null,null,"鹿児島城西高等学校"]
[]
[null,null,null,"校 長",null,null,null,null,"秋 武 達 朗 殿"]
[]
[]
[]
[null,null,null,null,null,null,null,null,null,null,null,null,null,null,null,null,null,null,null,null,null,null,null,null,null,null,null,null,null,null,"学 校 名",null,null,null,null,null,null,null,null,null,{"$f":"IF($CF$4=\"\",\"\",IF(入力用!$C$8=\"\",\"\",入力用!$C$8))","v":""}]
[]
[null,null,null,null,null,null,null,null,null,null,null,null,null,null,null,null,null,null,null,null,null,null,null,null,null,null,null,null,null,null,null,null,null,null,null,null,null,null,null,null,null,null,null,null,null,null,null,null,null,null,null,null,null,null,null,null,null,null,null,null,null,null,null,null,null,null,null,null,null,null,null,null,"職 印"]
[]
[null,null,null,null,null,null,null,null,null,null,null,null,null,null,null,null,null,null,null,null,null,null,null,null,null,null,null,null,null,null,"校 長 名",null,null,null,null,null,null,null,null,null,{"$f":"IF($CF$4=\"\",\"\",IF(入力用!$C$9=\"\",\"\",入力用!$C$9))","v":""}]
[]
[]
[]
[null,null,"下記のとおり相違ないことを証明します。"]
[]
[]
["ふりがな",null,null,null,null,null,null,null,null,{"$f":"IF($CF$4=\"\",\"\",IF(VLOOKUP($CF$4,入力用!$E$14:$BV$56,3)=\"\",\"\",VLOOKUP($CF$4,入力用!$E$14:$BV$56,3)))","v":"じょうせい　たろう"},null,null,null,null,null,null,null,null,null,null,null,null,null,null,null,null,null,null,null,null,null,null,null,null,null,null,null,"生年月日",null,null,null,null,null,null,null,null,"平成",null,null,null,{"$f":"IF($CF$4=\"\",\"\",IF(VLOOKUP($CF$4,入力用!$E$14:$BV$56,5)=\"\",\"\",VLOOKUP($CF$4,入力用!$E$14:$BV$56,5)))","v":""},null,null,null,"年",null,{"$f":"IF($CF$4=\"\",\"\",IF(VLOOKUP($CF$4,入力用!$E$14:$BV$56,6)=\"\",\"\",VLOOKUP($CF$4,入力用!$E$14:$BV$56,6)))","v":""},null,null,null,"月",null,{"$f":"IF($CF$4=\"\",\"\",IF(VLOOKUP($CF$4,入力用!$E$14:$BV$56,7)=\"\",\"\",VLOOKUP($CF$4,入力用!$E$14:$BV$56,7)))","v":""},null,null,null,"日生"]
[]
[]
[]
["生徒氏名",null,null,null,null,null,null,null,null,{"$f":"IF($CF$4=\"\",\"\",IF(VLOOKUP($CF$4,入力用!$E$14:$BV$56,2)=\"\",\"\",VLOOKUP($CF$4,入力用!$E$14:$BV$56,2)))","v":"城西　太郎"},null,null,null,null,null,null,null,null,null,null,null,null,null,null,null,null,null,null,null,null,null,null,null,null,null,null,null,null,{"$f":"IF($CF$4=\"\",\"\",IF(VLOOKUP($CF$4,入力用!$E$14:$BV$56,8)=\"\",\"\",VLOOKUP($CF$4,入力用!$E$14:$BV$56,8)))","v":"令和"},null,null,null,{"$f":"IF($CF$4=\"\",\"\",IF(VLOOKUP($CF$4,入力用!$E$14:$BV$56,9)=\"\",\"\",VLOOKUP($CF$4,入力用!$E$14:$BV$56,9)))","v":2},null,null,null,"年４月",null,null,null,null,{"$f":"IF($CF$4=\"\",\"\",IF(VLOOKUP($CF$4,入力用!$E$14:$BV$56,10)=\"\",\"\",VLOOKUP($CF$4,入力用!$E$14:$BV$56,10)))","v":"薩摩川内市立　東郷学園義務教育学校"},null,null,null,null,null,null,null,null,null,null,null,null,null,null,null,null,null,null,null,null,"入学"]
[]
[]
[]
[null,null,null,null,null,null,null,null,null,null,null,null,null,null,null,null,null,null,null,null,null,null,null,null,null,null,null,null,null,null,null,null,null,null,null,null,null,null,"令和",null,null,null,5,null,null,null,"年３月",null,null,null,null,{"$f":"IF($CF$4=\"\",\"\",IF(入力用!$C$8=\"\",\"\",入力用!$C$8))","v":""},null,null,null,null,null,null,null,null,null,null,null,null,null,null,null,null,null,null,null,null,"卒業見込"]
[]
[]
[]
["中学校・義務教育学\n校における在籍学級",null,null,null,null,null,null,null,null,null,{"$f":"IF($CF$4=\"\",\"\",IF(VLOOKUP($CF$4,入力用!$E$14:$BV$54,11)=\"\",\"\",IF(VLOOKUP($CF$4,入力用!$E$14:$BV$54,11)=\"１　通常学級\",\"○\",\"\")))","v":""},null,null,"１　通常学級",null,null,null,null,null,null,null,null,null,null,null,null,null,null,null,null,null,null,{"$f":"IF($CF$4=\"\",\"\",IF(VLOOKUP($CF$4,入力用!$E$14:$BV$54,11)=\"\",\"\",IF(VLOOKUP($CF$4,入力用!$E$14:$BV$54,11)=\"２　特別支援学級（知的）\",\"○\",\"\")))","v":""},null,null,"２　特別支援学級（知的）",null,null,null,null,null,null,null,null,null,null,null,null,null,null,null,null,null,null,{"$f":"IF($CF$4=\"\",\"\",IF(VLOOKUP($CF$4,入力用!$E$14:$BV$54,11)=\"\",\"\",IF(VLOOKUP($CF$4,入力用!$E$14:$BV$54,11)=\"３　特別支援学級(自閉・情緒)\",\"○\",\"\")))","v":"○"},null,null,"３　特別支援学級（自閉・情緒）"]
[]
[]
[]
[]
[null,null,null,"教　科",null,null,null,null,null,"評　定",null,null,null,null,null,"記　述　で　評　価\n（評定できない場合）",null,null,null,null,null,null,null,null,null,null,null,null,null,null,null,null,null,null,null,null,null,null,null,null,"出　　欠　　の　　記　　録"]
[]
[null,null,null,null,null,null,null,null,null,null,null,null,null,null,null,null,null,null,null,null,null,null,null,null,null,null,null,null,null,null,null,null,null,null,null,null,null,null,null,null,"学年",null,null,"欠席",null,null,"遅刻",null,null,"早退",null,null,"理　　　由"]
[]
["各教科の学習の記録",null,null,"国　語",null,null,null,null,null,{"$f":"IF($CF$4=\"\",\"\",IF(VLOOKUP($CF$4,入力用!$E$14:$BV$56,12)=\"\",\"\",VLOOKUP($CF$4,入力用!$E$14:$BV$56,12)))","v":""},null,null,null,null,null,{"$f":"IF($CF$4=\"\",\"\",IF(VLOOKUP($CF$4,入力用!$E$14:$BV$56,21)=\"\",\"\",VLOOKUP($CF$4,入力用!$E$14:$BV$56,21)))","v":"小学校４年生程度の読み書きができる。四字熟語を覚えるのが得意である。"},null,null,null,null,null,null,null,null,null,null,null,null,null,null,null,null,null,null,null,null,null,null,null,null,1,null,null,{"$f":"IF($CF$4=\"\",\"\",IF(VLOOKUP($CF$4,入力用!$E$14:$BV$56,30)=\"\",\"\",VLOOKUP($CF$4,入力用!$E$14:$BV$56,30)))","v":10},null,null,{"$f":"IF($CF$4=\"\",\"\",IF(VLOOKUP($CF$4,入力用!$E$14:$BV$56,31)=\"\",\"\",VLOOKUP($CF$4,入力用!$E$14:$BV$56,31)))","v":2},null,null,{"$f":"IF($CF$4=\"\",\"\",IF(VLOOKUP($CF$4,入力用!$E$14:$BV$56,32)=\"\",\"\",VLOOKUP($CF$4,入力用!$E$14:$BV$56,32)))","v":2},null,null,{"$f":"IF($CF$4=\"\",\"\",IF(VLOOKUP($CF$4,入力用!$E$14:$BV$56,33)=\"\",\"\",VLOOKUP($CF$4,入力用!$E$14:$BV$56,33)))","v":"欠席（気分不良9・発熱1）\n遅刻（寝坊2）早退（発熱2）"}]
[]
[]
[]
[null,null,null,"社　会",null,null,null,null,null,{"$f":"IF($CF$4=\"\",\"\",IF(VLOOKUP($CF$4,入力用!$E$14:$BV$56,13)=\"\",\"\",VLOOKUP($CF$4,入力用!$E$14:$BV$56,13)))","v":2},null,null,null,null,null,{"$f":"IF($CF$4=\"\",\"\",IF(VLOOKUP($CF$4,入力用!$E$14:$BV$56,22)=\"\",\"\",VLOOKUP($CF$4,入力用!$E$14:$BV$56,22)))","v":""},null,null,null,null,null,null,null,null,null,null,null,null,null,null,null,null,null,null,null,null,null,null,null,null,2,null,null,{"$f":"IF($CF$4=\"\",\"\",IF(VLOOKUP($CF$4,入力用!$E$14:$BV$56,34)=\"\",\"\",VLOOKUP($CF$4,入力用!$E$14:$BV$56,34)))","v":3},null,null,{"$f":"IF($CF$4=\"\",\"\",IF(VLOOKUP($CF$4,入力用!$E$14:$BV$56,35)=\"\",\"\",VLOOKUP($CF$4,入力用!$E$14:$BV$56,35)))","v":0},null,null,{"$f":"IF($CF$4=\"\",\"\",IF(VLOOKUP($CF$4,入力用!$E$14:$BV$56,36)=\"\",\"\",VLOOKUP($CF$4,入力用!$E$14:$BV$56,36)))","v":0},null,null,{"$f":"IF($CF$4=\"\",\"\",IF(VLOOKUP($CF$4,入力用!$E$14:$BV$56,37)=\"\",\"\",VLOOKUP($CF$4,入力用!$E$14:$BV$56,37)))","v":"欠席（気分不良2・発熱1）"}]
[]
[]
[]
[null,null,null,"数　学",null,null,null,null,null,{"$f":"IF($CF$4=\"\",\"\",IF(VLOOKUP($CF$4,入力用!$E$14:$BV$56,14)=\"\",\"\",VLOOKUP($CF$4,入力用!$E$14:$BV$56,14)))","v":""},null,null,null,null,null,{"$f":"IF($CF$4=\"\",\"\",IF(VLOOKUP($CF$4,入力用!$E$14:$BV$56,23)=\"\",\"\",VLOOKUP($CF$4,入力用!$E$14:$BV$56,23)))","v":"四則計算・時間・長さなどの問題に取り組んだ。文章問題は困難である。"},null,null,null,null,null,null,null,null,null,null,null,null,null,null,null,null,null,null,null,null,null,null,null,null,3,null,null,{"$f":"IF($CF$4=\"\",\"\",IF(VLOOKUP($CF$4,入力用!$E$14:$BV$56,38)=\"\",\"\",VLOOKUP($CF$4,入力用!$E$14:$BV$56,38)))","v":4},null,null,{"$f":"IF($CF$4=\"\",\"\",IF(VLOOKUP($CF$4,入力用!$E$14:$BV$56,39)=\"\",\"\",VLOOKUP($CF$4,入力用!$E$14:$BV$56,39)))","v":2},null,null,{"$f":"IF($CF$4=\"\",\"\",IF(VLOOKUP($CF$4,入力用!$E$14:$BV$56,40)=\"\",\"\",VLOOKUP($CF$4,入力用!$E$14:$BV$56,40)))","v":0},null,null,{"$f":"IF($CF$4=\"\",\"\",IF(VLOOKUP($CF$4,入力用!$E$14:$BV$56,41)=\"\",\"\",VLOOKUP($CF$4,入力用!$E$14:$BV$56,41)))","v":"欠席（気分不良3・腹痛1）\n遅刻（気分不良2）"}]
[]
[]
[]
[null,null,null,"理　科",null,null,null,null,null,{"$f":"IF($CF$4=\"\",\"\",IF(VLOOKUP($CF$4,入力用!$E$14:$BV$56,15)=\"\",\"\",VLOOKUP($CF$4,入力用!$E$14:$BV$56,15)))","v":2},null,null,null,null,null,{"$f":"IF($CF$4=\"\",\"\",IF(VLOOKUP($CF$4,入力用!$E$14:$BV$56,24)=\"\",\"\",VLOOKUP($CF$4,入力用!$E$14:$BV$56,24)))","v":""},null,null,null,null,null,null,null,null,null,null,null,null,null,null,null,null,null,null,null,null,null,null,null,null,"健　康　上　の　所　見",null,null,null,null,null,null,null,null,null,null,null,null,null,null,null,null,null,null,null,"特別活動の記録"]
[]
[null,null,null,null,null,null,null,null,null,null,null,null,null,null,null,null,null,null,null,null,null,null,null,null,null,null,null,null,null,null,null,null,null,null,null,null,null,null,null,null,{"$f":"IF($CF$4=\"\",\"\",IF(VLOOKUP($CF$4,入力用!$E$14:$BV$56,42)=\"\",\"\",VLOOKUP($CF$4,入力用!$E$14:$BV$56,42)))","v":"てんかん発作"},null,null,null,null,null,null,null,null,null,null,null,null,null,null,null,null,null,null,null,{"$f":"IF($CF$4=\"\",\"\",IF(VLOOKUP($CF$4,入力用!$E$14:$BV$56,43)=\"\",\"\",VLOOKUP($CF$4,入力用!$E$14:$BV$56,43)))","v":"水泳が得意である（障害者大会で鹿児島県2位を獲得）"}]
[]
[null,null,null,"音　楽",null,null,null,null,null,{"$f":"IF($CF$4=\"\",\"\",IF(VLOOKUP($CF$4,入力用!$E$14:$BV$56,16)=\"\",\"\",VLOOKUP($CF$4,入力用!$E$14:$BV$56,16)))","v":3},null,null,null,null,null,{"$f":"IF($CF$4=\"\",\"\",IF(VLOOKUP($CF$4,入力用!$E$14:$BV$56,25)=\"\",\"\",VLOOKUP($CF$4,入力用!$E$14:$BV$56,25)))","v":""}]
[]
[null,null,null,null,null,null,null,null,null,null,null,null,null,null,null,null,null,null,null,null,null,null,null,null,null,null,null,null,null,null,null,null,null,null,null,null,null,null,null,null,"特記事項（行動の特徴など）"]
[]
[null,null,null,"美　術",null,null,null,null,null,{"$f":"IF($CF$4=\"\",\"\",IF(VLOOKUP($CF$4,入力用!$E$14:$BV$56,17)=\"\",\"\",VLOOKUP($CF$4,入力用!$E$14:$BV$56,17)))","v":3},null,null,null,null,null,{"$f":"IF($CF$4=\"\",\"\",IF(VLOOKUP($CF$4,入力用!$E$14:$BV$56,26)=\"\",\"\",VLOOKUP($CF$4,入力用!$E$14:$BV$56,26)))","v":""},null,null,null,null,null,null,null,null,null,null,null,null,null,null,null,null,null,null,null,null,null,null,null,null,{"$f":"IF($CF$4=\"\",\"\",IF(VLOOKUP($CF$4,入力用!$E$14:$BV$56,44)=\"\",\"\",VLOOKUP($CF$4,入力用!$E$14:$BV$56,44)))","v":"　保健室に登校し，気持ちを落ち着けることで教室に入ることができた。全校集会など集団行動の場面では集団に入れず後方で参加した。感情の起伏が激しく，突発的な行動を起こすことがあるが，個別に話を聞くことで通常の活動に取り組むことができる。吃音があることで，人前で話すことが苦手である。"}]
[]
[]
[]
[null,null,null,"保　体",null,null,null,null,null,{"$f":"IF($CF$4=\"\",\"\",IF(VLOOKUP($CF$4,入力用!$E$14:$BV$56,18)=\"\",\"\",VLOOKUP($CF$4,入力用!$E$14:$BV$56,18)))","v":2},null,null,null,null,null,{"$f":"IF($CF$4=\"\",\"\",IF(VLOOKUP($CF$4,入力用!$E$14:$BV$56,27)=\"\",\"\",VLOOKUP($CF$4,入力用!$E$14:$BV$56,27)))","v":""}]
[]
[]
[]
[null,null,null,"技・家",null,null,null,null,null,{"$f":"IF($CF$4=\"\",\"\",IF(VLOOKUP($CF$4,入力用!$E$14:$BV$56,19)=\"\",\"\",VLOOKUP($CF$4,入力用!$E$14:$BV$56,19)))","v":2},null,null,null,null,null,{"$f":"IF($CF$4=\"\",\"\",IF(VLOOKUP($CF$4,入力用!$E$14:$BV$56,28)=\"\",\"\",VLOOKUP($CF$4,入力用!$E$14:$BV$56,28)))","v":""}]
{"$rows_left_out":30}