{"text_format":"1","workbook":"xlsx","n_sheets":7,"sheets":["入力方法　※必ずお読みください","①中学校名","②氏名・生年月日・入卒","③評定","④欠席・遅刻・早退","⑤健康・特活・転校・所見","推薦書印刷"],"not_rendered":{"charts":0,"images":0,"macros":1,"external_links":0,"defined_names":1,"comments":0,"pivot_tables":0},"unopened":[],"bounds":{"document_bytes":16777216,"sheet_cells":100000,"rows_first":2000,"rows_last":500,"rows_between":2000,"halvings":0,"cell_chars":16384,"cell_head_chars":4096},"cells_cut":0,"cells_raw":0,"read":"whole","date_system":"1900"}

{"sheet":"入力方法　※必ずお読みください","index":0,"n_rows":61,"n_cols":5,"rows_kept":61,"cut":false,"hidden":false,"merged":[[41,2,41,3],[44,2,44,3],[25,2,25,3]]}
[]
[null,"推薦書入力方法について"]
[]
[]
[]
[null,null,"次の７つのシートがあります。"]
[null,null,"１．","入力方法（本シート）"]
[null,null,"２．","中学校名"]
[null,null,"３．","氏名・生年月日・入卒"]
[null,null,"４．","評定"]
[null,null,"５．","欠席・遅刻・早退"]
[null,null,"６．","健康・特活・転校・所見"]
[null,null,"７．","推薦書印刷"]
[]
[null,null,"上の２～６のシートに順番通り入力し、「推薦書印刷」シートで印刷となります。"]
[]
[null,null,"①中学校名","シート"]
[null,null,null,"文字または数字は白色の部分に入力してください。"]
[null,null,null,"水色の部分は入力できないように保護されています。"]
[null,null,"・","提出年月日を赤の枠に（入力例）のように半角数字で入力してください。"]
{"$rows_left_out":42}
{"sheet":"①中学校名","index":1,"n_rows":18,"n_cols":12,"rows_kept":18,"cut":false,"hidden":false,"merged":[[8,3,8,5],[16,3,16,5],[0,0,0,2],[12,3,12,5],[7,2,8,2]]}
["①中学校名などの入力"]
[]
[]
[null,null,null,"令和　  年","月","日"]
[null,null,"提出年月日"]
[null,null,"（入力例）",8,1,4]
[]
[null,null,"中学校・義務教育学校名"]
[]
[null,null,"（入力例）","○○町立○○中学校"]
[]
[null,null,null,null,null,null,null,null,null,"中学校","（中学校用）","中学校名"]
[null,null,"学校の区分",null,null,null,null,null,null,"義務教育学校","（義務教育学校用）","義務教育学校名"]
[null,null,null,"※中学校・義務教育学校をリストから選択"]
[]
[]
[null,null,"校長名"]
[null,null,"（入力例）","山田　太郎"]

{"sheet":"②氏名・生年月日・入卒","index":2,"n_rows":1510,"n_cols":27,"rows_kept":1510,"cut":false,"hidden":false,"merged":[[2,15,2,17],[2,24,3,24],[2,19,2,22],[0,0,0,7],[3,19,3,20],[2,11,2,13],[3,11,3,12]]}
["②氏名・生年月日・入学卒業に関する入力"]
[null,null,null,null,null,null,null,null,1,"男"]
[null,null,null,null,null,null,null,null,2,"女",null,"入学",null,null,null,"卒業見込み",null,null,null,"過年度卒業者",null,null,null,null,"記載責任者"]
["NO","組","番","生徒名","ふりがな","生年","生月","生日","性別","男",null,"入学年",null,"入学校",null,"卒年","卒月","卒学校",null,"卒業年",null,"卒月","中学校"]
["（例）",3,2,"私学　協子","しがく　きょうこ",21,4,8,2,"女",null,"令和",5,"〇〇町立△△中学校",null,8,3,"〇〇町立△△中学校",null,"令和",7,3,"〇〇町立△△中学校",null,"私学　協太郎"]
[1,null,null,null,null,null,null,null,null,{"$f":"IFERROR(VLOOKUP(I6,$I$2:$J$3,2),\"\")","v":""},null,null,null,null,null,null,null,null,null,null,null,null,null,null,null,null,{"$f":"IF(B6=\"\",\"\",1)","v":""}]
[2,null,null,null,null,null,null,null,null,{"$f":"IFERROR(VLOOKUP(I7,$I$2:$J$3,2),\"\")","v":""},null,null,null,null,null,null,null,null,null,null,null,null,null,null,null,null,{"$f":"IF(B7=\"\",\"\",1)","v":""}]
[3,null,null,null,null,null,null,null,null,"",null,null,null,null,null,null,null,null,null,null,null,null,null,null,null,null,""]
[4,null,null,null,null,null,null,null,null,"",null,null,null,null,null,null,null,null,null,null,null,null,null,null,null,null,""]
[5,null,null,null,null,null,null,null,null,"",null,null,null,null,null,null,null,null,null,null,null,null,null,null,null,null,""]
[6,null,null,null,null,null,null,null,null,"",null,null,null,null,null,null,null,null,null,null,null,null,null,null,null,null,""]
[7,null,null,null,null,null,null,null,null,"",null,null,null,null,null,null,null,null,null,null,null,null,null,null,null,null,""]
[8,null,null,null,null,null,null,null,null,"",null,null,null,null,null,null,null,null,null,null,null,null,null,null,null,null,""]
[9,null,null,null,null,null,null,null,null,"",null,null,null,null,null,null,null,null,null,null,null,null,null,null,null,null,""]
[10,null,null,null,null,null,null,null,null,"",null,null,null,null,null,null,null,null,null,null,null,null,null,null,null,null,""]
[11,null,null,null,null,null,null,null,null,"",null,null,null,null,null,null,null,null,null,null,null,null,null,null,null,null,""]
[12,null,null,null,null,null,null,null,null,"",null,null,null,null,null,null,null,null,null,null,null,null,null,null,null,null,""]
[13,null,null,null,null,null,null,null,null,"",null,null,null,null,null,null,null,null,null,null,null,null,null,null,null,null,""]
[14,null,null,null,null,null,null,null,null,"",null,null,null,null,null,null,null,null,null,null,null,null,null,null,null,null,""]
[15,null,null,null,null,null,null,null,null,"",null,null,null,null,null,null,null,null,null,null,null,null,null,null,null,null,""]
{"$rows_left_out":1491}
{"sheet":"③評定","index":3,"n_rows":104,"n_cols":31,"rows_kept":104,"cut":false,"hidden":false,"merged":[[0,0,0,3],[1,22,1,30],[1,13,1,21],[1,4,1,12],[1,0,2,0],[1,3,2,3],[1,2,2,2],[1,1,2,1]]}
["③評定の入力"]
["No","組","番","生徒名",{"$f":"IF(①中学校名!$D$13=\"義務教育学校\",\"７学年評定\",\"１学年評定\")","v":"１学年評定"},null,null,null,null,null,null,null,null,{"$f":"IF(①中学校名!$D$13=\"義務教育学校\",\"８学年評定\",\"２学年評定\")","v":"２学年評定"},null,null,null,null,null,null,null,null,{"$f":"IF(①中学校名!$D$13=\"義務教育学校\",\"９学年評定\",\"３学年評定\")","v":"３学年評定"}]
[null,null,null,null,"国","社","数","理","音","美","体","家","英","国","社","数","理","音","美","体","家","英","国","社","数","理","音","美","体","家","英"]
["（例）",3,2,"私学　協子",4,5,3,4,4,4,4,4,5,3,4,4,4,4,4,5,5,3,4,4,4,3,4,4,5,4,4]
[1,{"$f":"IF(②氏名・生年月日・入卒!B6=\"\",\"\",VLOOKUP(A5,②氏名・生年月日・入卒!$A$6:$D$105,2))","v":""},{"$f":"IF(②氏名・生年月日・入卒!B6=\"\",\"\",VLOOKUP(A5,②氏名・生年月日・入卒!$A$6:$D$105,3))","v":""},{"$f":"IF(②氏名・生年月日・入卒!B6=\"\",\"\",VLOOKUP(A5,②氏名・生年月日・入卒!$A$6:$D$105,4))","v":""}]
[2,{"$f":"IF(②氏名・生年月日・入卒!B7=\"\",\"\",VLOOKUP(A6,②氏名・生年月日・入卒!$A$6:$D$105,2))","v":""},{"$f":"IF(②氏名・生年月日・入卒!B7=\"\",\"\",VLOOKUP(A6,②氏名・生年月日・入卒!$A$6:$D$105,3))","v":""},{"$f":"IF(②氏名・生年月日・入卒!B7=\"\",\"\",VLOOKUP(A6,②氏名・生年月日・入卒!$A$6:$D$105,4))","v":""}]
[3,{"$f":"IF(②氏名・生年月日・入卒!B8=\"\",\"\",VLOOKUP(A7,②氏名・生年月日・入卒!$A$6:$D$105,2))","v":""},{"$f":"IF(②氏名・生年月日・入卒!B8=\"\",\"\",VLOOKUP(A7,②氏名・生年月日・入卒!$A$6:$D$105,3))","v":""},{"$f":"IF(②氏名・生年月日・入卒!B8=\"\",\"\",VLOOKUP(A7,②氏名・生年月日・入卒!$A$6:$D$105,4))","v":""}]
[4,{"$f":"IF(②氏名・生年月日・入卒!B9=\"\",\"\",VLOOKUP(A8,②氏名・生年月日・入卒!$A$6:$D$105,2))","v":""},{"$f":"IF(②氏名・生年月日・入卒!B9=\"\",\"\",VLOOKUP(A8,②氏名・生年月日・入卒!$A$6:$D$105,3))","v":""},{"$f":"IF(②氏名・生年月日・入卒!B9=\"\",\"\",VLOOKUP(A8,②氏名・生年月日・入卒!$A$6:$D$105,4))","v":""}]
[5,{"$f":"IF(②氏名・生年月日・入卒!B10=\"\",\"\",VLOOKUP(A9,②氏名・生年月日・入卒!$A$6:$D$105,2))","v":""},{"$f":"IF(②氏名・生年月日・入卒!B10=\"\",\"\",VLOOKUP(A9,②氏名・生年月日・入卒!$A$6:$D$105,3))","v":""},{"$f":"IF(②氏名・生年月日・入卒!B10=\"\",\"\",VLOOKUP(A9,②氏名・生年月日・入卒!$A$6:$D$105,4))","v":""}]
[6,{"$f":"IF(②氏名・生年月日・入卒!B11=\"\",\"\",VLOOKUP(A10,②氏名・生年月日・入卒!$A$6:$D$105,2))","v":""},{"$f":"IF(②氏名・生年月日・入卒!B11=\"\",\"\",VLOOKUP(A10,②氏名・生年月日・入卒!$A$6:$D$105,3))","v":""},{"$f":"IF(②氏名・生年月日・入卒!B11=\"\",\"\",VLOOKUP(A10,②氏名・生年月日・入卒!$A$6:$D$105,4))","v":""}]
[7,{"$f":"IF(②氏名・生年月日・入卒!B12=\"\",\"\",VLOOKUP(A11,②氏名・生年月日・入卒!$A$6:$D$105,2))","v":""},{"$f":"IF(②氏名・生年月日・入卒!B12=\"\",\"\",VLOOKUP(A11,②氏名・生年月日・入卒!$A$6:$D$105,3))","v":""},{"$f":"IF(②氏名・生年月日・入卒!B12=\"\",\"\",VLOOKUP(A11,②氏名・生年月日・入卒!$A$6:$D$105,4))","v":""}]
[8,{"$f":"IF(②氏名・生年月日・入卒!B13=\"\",\"\",VLOOKUP(A12,②氏名・生年月日・入卒!$A$6:$D$105,2))","v":""},{"$f":"IF(②氏名・生年月日・入卒!B13=\"\",\"\",VLOOKUP(A12,②氏名・生年月日・入卒!$A$6:$D$105,3))","v":""},{"$f":"IF(②氏名・生年月日・入卒!B13=\"\",\"\",VLOOKUP(A12,②氏名・生年月日・入卒!$A$6:$D$105,4))","v":""}]
[9,{"$f":"IF(②氏名・生年月日・入卒!B14=\"\",\"\",VLOOKUP(A13,②氏名・生年月日・入卒!$A$6:$D$105,2))","v":""},{"$f":"IF(②氏名・生年月日・入卒!B14=\"\",\"\",VLOOKUP(A13,②氏名・生年月日・入卒!$A$6:$D$105,3))","v":""},{"$f":"IF(②氏名・生年月日・入卒!B14=\"\",\"\",VLOOKUP(A13,②氏名・生年月日・入卒!$A$6:$D$105,4))","v":""}]
[10,{"$f":"IF(②氏名・生年月日・入卒!B15=\"\",\"\",VLOOKUP(A14,②氏名・生年月日・入卒!$A$6:$D$105,2))","v":""},{"$f":"IF(②氏名・生年月日・入卒!B15=\"\",\"\",VLOOKUP(A14,②氏名・生年月日・入卒!$A$6:$D$105,3))","v":""},{"$f":"IF(②氏名・生年月日・入卒!B15=\"\",\"\",VLOOKUP(A14,②氏名・生年月日・入卒!$A$6:$D$105,4))","v":""}]
[11,{"$f":"IF(②氏名・生年月日・入卒!B16=\"\",\"\",VLOOKUP(A15,②氏名・生年月日・入卒!$A$6:$D$105,2))","v":""},{"$f":"IF(②氏名・生年月日・入卒!B16=\"\",\"\",VLOOKUP(A15,②氏名・生年月日・入卒!$A$6:$D$105,3))","v":""},{"$f":"IF(②氏名・生年月日・入卒!B16=\"\",\"\",VLOOKUP(A15,②氏名・生年月日・入卒!$A$6:$D$105,4))","v":""}]
[12,{"$f":"IF(②氏名・生年月日・入卒!B17=\"\",\"\",VLOOKUP(A16,②氏名・生年月日・入卒!$A$6:$D$105,2))","v":""},{"$f":"IF(②氏名・生年月日・入卒!B17=\"\",\"\",VLOOKUP(A16,②氏名・生年月日・入卒!$A$6:$D$105,3))","v":""},{"$f":"IF(②氏名・生年月日・入卒!B17=\"\",\"\",VLOOKUP(A16,②氏名・生年月日・入卒!$A$6:$D$105,4))","v":""}]
[13,{"$f":"IF(②氏名・生年月日・入卒!B18=\"\",\"\",VLOOKUP(A17,②氏名・生年月日・入卒!$A$6:$D$105,2))","v":""},{"$f":"IF(②氏名・生年月日・入卒!B18=\"\",\"\",VLOOKUP(A17,②氏名・生年月日・入卒!$A$6:$D$105,3))","v":""},{"$f":"IF(②氏名・生年月日・入卒!B18=\"\",\"\",VLOOKUP(A17,②氏名・生年月日・入卒!$A$6:$D$105,4))","v":""}]
[14,{"$f":"IF(②氏名・生年月日・入卒!B19=\"\",\"\",VLOOKUP(A18,②氏名・生年月日・入卒!$A$6:$D$105,2))","v":""},{"$f":"IF(②氏名・生年月日・入卒!B19=\"\",\"\",VLOOKUP(A18,②氏名・生年月日・入卒!$A$6:$D$105,3))","v":""},{"$f":"IF(②氏名・生年月日・入卒!B19=\"\",\"\",VLOOKUP(A18,②氏名・生年月日・入卒!$A$6:$D$105,4))","v":""}]
[15,{"$f":"IF(②氏名・生年月日・入卒!B20=\"\",\"\",VLOOKUP(A19,②氏名・生年月日・入卒!$A$6:$D$105,2))","v":""},{"$f":"IF(②氏名・生年月日・入卒!B20=\"\",\"\",VLOOKUP(A19,②氏名・生年月日・入卒!$A$6:$D$105,3))","v":""},{"$f":"IF(②氏名・生年月日・入卒!B20=\"\",\"\",VLOOKUP(A19,②氏名・生年月日・入卒!$A$6:$D$105,4))","v":""}]
[16,{"$f":"IF(②氏名・生年月日・入卒!B21=\"\",\"\",VLOOKUP(A20,②氏名・生年月日・入卒!$A$6:$D$105,2))","v":""},{"$f":"IF(②氏名・生年月日・入卒!B21=\"\",\"\",VLOOKUP(A20,②氏名・生年月日・入卒!$A$6:$D$105,3))","v":""},{"$f":"IF(②氏名・生年月日・入卒!B21=\"\",\"\",VLOOKUP(A20,②氏名・生年月日・入卒!$A$6:$D$105,4))","v":""}]
{"$rows_left_out":85}
{"sheet":"④欠席・遅刻・早退","index":4,"n_rows":104,"n_cols":16,"rows_kept":104,"cut":false,"hidden":false,"merged":[[0,0,0,4],[1,4,1,7],[1,8,1,11],[1,12,1,15],[1,0,2,0],[1,1,2,1],[1,2,2,2],[1,3,2,3]]}
["④欠席・遅刻・早退の入力"]
["No","組","番","生徒名",{"$f":"IF(①中学校名!$D$13=\"義務教育学校\",\"７学年\",\"１学年\")","v":"１学年"},null,null,null,{"$f":"IF(①中学校名!$D$13=\"義務教育学校\",\"８学年\",\"２学年\")","v":"２学年"},null,null,null,{"$f":"IF(①中学校名!$D$13=\"義務教育学校\",\"９学年\",\"３学年\")","v":"３学年"}]
[null,null,null,null,"欠席","遅刻","早退","欠席・遅刻・早退の主な理由","欠席","遅刻","早退","欠席・遅刻・早退の主な理由","欠席","遅刻","早退","欠席・遅刻・早退の主な理由"]
["（例）",3,2,"私学　協子",1,0,0,"体調不良（1日）",0,0,0,"皆勤",0,1,0,"病院受診（1日）"]
[1,{"$f":"VLOOKUP(A5,②氏名・生年月日・入卒!$A$6:$D$105,2)","v":0},{"$f":"VLOOKUP(A5,②氏名・生年月日・入卒!$A$6:$D$105,3)","v":0},{"$f":"VLOOKUP(A5,②氏名・生年月日・入卒!$A$6:$D$105,4)","v":0}]
[2,{"$f":"VLOOKUP(A6,②氏名・生年月日・入卒!$A$6:$D$105,2)","v":0},{"$f":"VLOOKUP(A6,②氏名・生年月日・入卒!$A$6:$D$105,3)","v":0},{"$f":"VLOOKUP(A6,②氏名・生年月日・入卒!$A$6:$D$105,4)","v":0}]
[3,{"$f":"VLOOKUP(A7,②氏名・生年月日・入卒!$A$6:$D$105,2)","v":0},{"$f":"VLOOKUP(A7,②氏名・生年月日・入卒!$A$6:$D$105,3)","v":0},{"$f":"VLOOKUP(A7,②氏名・生年月日・入卒!$A$6:$D$105,4)","v":0}]
[4,{"$f":"VLOOKUP(A8,②氏名・生年月日・入卒!$A$6:$D$105,2)","v":0},{"$f":"VLOOKUP(A8,②氏名・生年月日・入卒!$A$6:$D$105,3)","v":0},{"$f":"VLOOKUP(A8,②氏名・生年月日・入卒!$A$6:$D$105,4)","v":0}]
[5,{"$f":"VLOOKUP(A9,②氏名・生年月日・入卒!$A$6:$D$105,2)","v":0},{"$f":"VLOOKUP(A9,②氏名・生年月日・入卒!$A$6:$D$105,3)","v":0},{"$f":"VLOOKUP(A9,②氏名・生年月日・入卒!$A$6:$D$105,4)","v":0}]
[6,{"$f":"VLOOKUP(A10,②氏名・生年月日・入卒!$A$6:$D$105,2)","v":0},{"$f":"VLOOKUP(A10,②氏名・生年月日・入卒!$A$6:$D$105,3)","v":0},{"$f":"VLOOKUP(A10,②氏名・生年月日・入卒!$A$6:$D$105,4)","v":0}]
[7,{"$f":"VLOOKUP(A11,②氏名・生年月日・入卒!$A$6:$D$105,2)","v":0},{"$f":"VLOOKUP(A11,②氏名・生年月日・入卒!$A$6:$D$105,3)","v":0},{"$f":"VLOOKUP(A11,②氏名・生年月日・入卒!$A$6:$D$105,4)","v":0}]
[8,{"$f":"VLOOKUP(A12,②氏名・生年月日・入卒!$A$6:$D$105,2)","v":0},{"$f":"VLOOKUP(A12,②氏名・生年月日・入卒!$A$6:$D$105,3)","v":0},{"$f":"VLOOKUP(A12,②氏名・生年月日・入卒!$A$6:$D$105,4)","v":0}]
[9,{"$f":"VLOOKUP(A13,②氏名・生年月日・入卒!$A$6:$D$105,2)","v":0},{"$f":"VLOOKUP(A13,②氏名・生年月日・入卒!$A$6:$D$105,3)","v":0},{"$f":"VLOOKUP(A13,②氏名・生年月日・入卒!$A$6:$D$105,4)","v":0}]
[10,{"$f":"VLOOKUP(A14,②氏名・生年月日・入卒!$A$6:$D$105,2)","v":0},{"$f":"VLOOKUP(A14,②氏名・生年月日・入卒!$A$6:$D$105,3)","v":0},{"$f":"VLOOKUP(A14,②氏名・生年月日・入卒!$A$6:$D$105,4)","v":0}]
[11,{"$f":"VLOOKUP(A15,②氏名・生年月日・入卒!$A$6:$D$105,2)","v":0},{"$f":"VLOOKUP(A15,②氏名・生年月日・入卒!$A$6:$D$105,3)","v":0},{"$f":"VLOOKUP(A15,②氏名・生年月日・入卒!$A$6:$D$105,4)","v":0}]
[12,{"$f":"VLOOKUP(A16,②氏名・生年月日・入卒!$A$6:$D$105,2)","v":0},{"$f":"VLOOKUP(A16,②氏名・生年月日・入卒!$A$6:$D$105,3)","v":0},{"$f":"VLOOKUP(A16,②氏名・生年月日・入卒!$A$6:$D$105,4)","v":0}]
[13,{"$f":"VLOOKUP(A17,②氏名・生年月日・入卒!$A$6:$D$105,2)","v":0},{"$f":"VLOOKUP(A17,②氏名・生年月日・入卒!$A$6:$D$105,3)","v":0},{"$f":"VLOOKUP(A17,②氏名・生年月日・入卒!$A$6:$D$105,4)","v":0}]
[14,{"$f":"VLOOKUP(A18,②氏名・生年月日・入卒!$A$6:$D$105,2)","v":0},{"$f":"VLOOKUP(A18,②氏名・生年月日・入卒!$A$6:$D$105,3)","v":0},{"$f":"VLOOKUP(A18,②氏名・生年月日・入卒!$A$6:$D$105,4)","v":0}]
[15,{"$f":"VLOOKUP(A19,②氏名・生年月日・入卒!$A$6:$D$105,2)","v":0},{"$f":"VLOOKUP(A19,②氏名・生年月日・入卒!$A$6:$D$105,3)","v":0},{"$f":"VLOOKUP(A19,②氏名・生年月日・入卒!$A$6:$D$105,4)","v":0}]
[16,{"$f":"VLOOKUP(A20,②氏名・生年月日・入卒!$A$6:$D$105,2)","v":0},{"$f":"VLOOKUP(A20,②氏名・生年月日・入卒!$A$6:$D$105,3)","v":0},{"$f":"VLOOKUP(A20,②氏名・生年月日・入卒!$A$6:$D$105,4)","v":0}]
{"$rows_left_out":85}
{"sheet":"⑤健康・特活・転校・所見","index":5,"n_rows":104,"n_cols":11,"rows_kept":104,"cut":false,"hidden":false,"merged":[[1,6,1,9],[1,10,2,10],[0,0,0,5],[1,0,2,0],[1,1,2,1],[1,2,2,2],[1,3,2,3],[1,4,2,4],[1,5,2,5]]}
["⑤健康状態・特別活動等の記録・転入学・担任所見および指導上の参考事項の入力"]
["NO","組","番","生徒名","健康状態","特別活動等の記録","転入学者",null,null,null,"推薦所見"]
[null,null,null,null,null,null,"転入学年","転入学月","中学校(学園)名","転入学の理由"]
["（例）",3,2,"私学　協子","異常なし","弓道部主将としてリーダーシップを発揮し、地区優勝に貢献した。","令和4",7,"東京都立第八","一家転住のため","素直で誰とでも分け隔てなく接することができる生徒である。何事にも真面目で努力している。"]
[1,{"$f":"IF(②氏名・生年月日・入卒!B6=\"\",\"\",VLOOKUP(A5,②氏名・生年月日・入卒!$A$6:$D$105,2))","v":""},{"$f":"IF(②氏名・生年月日・入卒!B6=\"\",\"\",VLOOKUP(A5,②氏名・生年月日・入卒!$A$6:$D$105,3))","v":""},{"$f":"IF(②氏名・生年月日・入卒!B6=\"\",\"\",VLOOKUP(A5,②氏名・生年月日・入卒!$A$6:$D$105,4))","v":""}]
[2,{"$f":"IF(②氏名・生年月日・入卒!B7=\"\",\"\",VLOOKUP(A6,②氏名・生年月日・入卒!$A$6:$D$105,2))","v":""},{"$f":"IF(②氏名・生年月日・入卒!B7=\"\",\"\",VLOOKUP(A6,②氏名・生年月日・入卒!$A$6:$D$105,3))","v":""},{"$f":"IF(②氏名・生年月日・入卒!B7=\"\",\"\",VLOOKUP(A6,②氏名・生年月日・入卒!$A$6:$D$105,4))","v":""}]
[3,{"$f":"IF(②氏名・生年月日・入卒!B8=\"\",\"\",VLOOKUP(A7,②氏名・生年月日・入卒!$A$6:$D$105,2))","v":""},{"$f":"IF(②氏名・生年月日・入卒!B8=\"\",\"\",VLOOKUP(A7,②氏名・生年月日・入卒!$A$6:$D$105,3))","v":""},{"$f":"IF(②氏名・生年月日・入卒!B8=\"\",\"\",VLOOKUP(A7,②氏名・生年月日・入卒!$A$6:$D$105,4))","v":""}]
[4,{"$f":"IF(②氏名・生年月日・入卒!B9=\"\",\"\",VLOOKUP(A8,②氏名・生年月日・入卒!$A$6:$D$105,2))","v":""},{"$f":"IF(②氏名・生年月日・入卒!B9=\"\",\"\",VLOOKUP(A8,②氏名・生年月日・入卒!$A$6:$D$105,3))","v":""},{"$f":"IF(②氏名・生年月日・入卒!B9=\"\",\"\",VLOOKUP(A8,②氏名・生年月日・入卒!$A$6:$D$105,4))","v":""}]
[5,{"$f":"IF(②氏名・生年月日・入卒!B10=\"\",\"\",VLOOKUP(A9,②氏名・生年月日・入卒!$A$6:$D$105,2))","v":""},{"$f":"IF(②氏名・生年月日・入卒!B10=\"\",\"\",VLOOKUP(A9,②氏名・生年月日・入卒!$A$6:$D$105,3))","v":""},{"$f":"IF(②氏名・生年月日・入卒!B10=\"\",\"\",VLOOKUP(A9,②氏名・生年月日・入卒!$A$6:$D$105,4))","v":""}]
[6,{"$f":"IF(②氏名・生年月日・入卒!B11=\"\",\"\",VLOOKUP(A10,②氏名・生年月日・入卒!$A$6:$D$105,2))","v":""},{"$f":"IF(②氏名・生年月日・入卒!B11=\"\",\"\",VLOOKUP(A10,②氏名・生年月日・入卒!$A$6:$D$105,3))","v":""},{"$f":"IF(②氏名・生年月日・入卒!B11=\"\",\"\",VLOOKUP(A10,②氏名・生年月日・入卒!$A$6:$D$105,4))","v":""}]
[7,{"$f":"IF(②氏名・生年月日・入卒!B12=\"\",\"\",VLOOKUP(A11,②氏名・生年月日・入卒!$A$6:$D$105,2))","v":""},{"$f":"IF(②氏名・生年月日・入卒!B12=\"\",\"\",VLOOKUP(A11,②氏名・生年月日・入卒!$A$6:$D$105,3))","v":""},{"$f":"IF(②氏名・生年月日・入卒!B12=\"\",\"\",VLOOKUP(A11,②氏名・生年月日・入卒!$A$6:$D$105,4))","v":""}]
[8,{"$f":"IF(②氏名・生年月日・入卒!B13=\"\",\"\",VLOOKUP(A12,②氏名・生年月日・入卒!$A$6:$D$105,2))","v":""},{"$f":"IF(②氏名・生年月日・入卒!B13=\"\",\"\",VLOOKUP(A12,②氏名・生年月日・入卒!$A$6:$D$105,3))","v":""},{"$f":"IF(②氏名・生年月日・入卒!B13=\"\",\"\",VLOOKUP(A12,②氏名・生年月日・入卒!$A$6:$D$105,4))","v":""}]
[9,{"$f":"IF(②氏名・生年月日・入卒!B14=\"\",\"\",VLOOKUP(A13,②氏名・生年月日・入卒!$A$6:$D$105,2))","v":""},{"$f":"IF(②氏名・生年月日・入卒!B14=\"\",\"\",VLOOKUP(A13,②氏名・生年月日・入卒!$A$6:$D$105,3))","v":""},{"$f":"IF(②氏名・生年月日・入卒!B14=\"\",\"\",VLOOKUP(A13,②氏名・生年月日・入卒!$A$6:$D$105,4))","v":""}]
[10,{"$f":"IF(②氏名・生年月日・入卒!B15=\"\",\"\",VLOOKUP(A14,②氏名・生年月日・入卒!$A$6:$D$105,2))","v":""},{"$f":"IF(②氏名・生年月日・入卒!B15=\"\",\"\",VLOOKUP(A14,②氏名・生年月日・入卒!$A$6:$D$105,3))","v":""},{"$f":"IF(②氏名・生年月日・入卒!B15=\"\",\"\",VLOOKUP(A14,②氏名・生年月日・入卒!$A$6:$D$105,4))","v":""}]
[11,{"$f":"IF(②氏名・生年月日・入卒!B16=\"\",\"\",VLOOKUP(A15,②氏名・生年月日・入卒!$A$6:$D$105,2))","v":""},{"$f":"IF(②氏名・生年月日・入卒!B16=\"\",\"\",VLOOKUP(A15,②氏名・生年月日・入卒!$A$6:$D$105,3))","v":""},{"$f":"IF(②氏名・生年月日・入卒!B16=\"\",\"\",VLOOKUP(A15,②氏名・生年月日・入卒!$A$6:$D$105,4))","v":""}]
[12,{"$f":"IF(②氏名・生年月日・入卒!B17=\"\",\"\",VLOOKUP(A16,②氏名・生年月日・入卒!$A$6:$D$105,2))","v":""},{"$f":"IF(②氏名・生年月日・入卒!B17=\"\",\"\",VLOOKUP(A16,②氏名・生年月日・入卒!$A$6:$D$105,3))","v":""},{"$f":"IF(②氏名・生年月日・入卒!B17=\"\",\"\",VLOOKUP(A16,②氏名・生年月日・入卒!$A$6:$D$105,4))","v":""}]
[13,{"$f":"IF(②氏名・生年月日・入卒!B18=\"\",\"\",VLOOKUP(A17,②氏名・生年月日・入卒!$A$6:$D$105,2))","v":""},{"$f":"IF(②氏名・生年月日・入卒!B18=\"\",\"\",VLOOKUP(A17,②氏名・生年月日・入卒!$A$6:$D$105,3))","v":""},{"$f":"IF(②氏名・生年月日・入卒!B18=\"\",\"\",VLOOKUP(A17,②氏名・生年月日・入卒!$A$6:$D$105,4))","v":""}]
[14,{"$f":"IF(②氏名・生年月日・入卒!B19=\"\",\"\",VLOOKUP(A18,②氏名・生年月日・入卒!$A$6:$D$105,2))","v":""},{"$f":"IF(②氏名・生年月日・入卒!B19=\"\",\"\",VLOOKUP(A18,②氏名・生年月日・入卒!$A$6:$D$105,3))","v":""},{"$f":"IF(②氏名・生年月日・入卒!B19=\"\",\"\",VLOOKUP(A18,②氏名・生年月日・入卒!$A$6:$D$105,4))","v":""}]
[15,{"$f":"IF(②氏名・生年月日・入卒!B20=\"\",\"\",VLOOKUP(A19,②氏名・生年月日・入卒!$A$6:$D$105,2))","v":""},{"$f":"IF(②氏名・生年月日・入卒!B20=\"\",\"\",VLOOKUP(A19,②氏名・生年月日・入卒!$A$6:$D$105,3))","v":""},{"$f":"IF(②氏名・生年月日・入卒!B20=\"\",\"\",VLOOKUP(A19,②氏名・生年月日・入卒!$A$6:$D$105,4))","v":""}]
[16,{"$f":"IF(②氏名・生年月日・入卒!B21=\"\",\"\",VLOOKUP(A20,②氏名・生年月日・入卒!$A$6:$D$105,2))","v":""},{"$f":"IF(②氏名・生年月日・入卒!B21=\"\",\"\",VLOOKUP(A20,②氏名・生年月日・入卒!$A$6:$D$105,3))","v":""},{"$f":"IF(②氏名・生年月日・入卒!B21=\"\",\"\",VLOOKUP(A20,②氏名・生年月日・入卒!$A$6:$D$105,4))","v":""}]
{"$rows_left_out":85}
{"sheet":"推薦書印刷","index":6,"n_rows":212,"n_cols":143,"rows_kept":212,"cut":false,"hidden":false,"merged":[[5,142,9,142],[10,142,14,142],[15,141,19,141],[15,142,19,142],[47,1,78,1],[11,1,46,1],[79,1,112,1],[113,1,136,1],[137,1,196,1],[66,30,72,34],[66,35,72,40],[66,41,72,45],[47,124,56,136],[53,3,65,16],[53,17,65,58],[57,59,67,65],[57,66,67,71],[57,72,67,77],[57,78,67,84],[68,124,78,136],[73,3,78,16],[73,17,78,58],[79,3,112,8],[79,9,88,16],[197,1,203,1],[5,141,9,141],[10,141,14,141],[33,79,38,120],[34,36,37,78],[68,90,78,123],[57,90,67,123],[47,90,56,123],[68,59,78,65],[13,109,16,112],[13,113,16,120],[13,121,16,124],[13,125,16,132],[13,133,16,136],[20,12,25,124],[47,3,52,16],[47,17,52,58],[47,59,56,65],[47,66,56,71],[47,72,56,77],[47,78,56,84],[47,85,56,89],[66,17,72,23],[66,24,72,29],[1,119,1,135],[3,3,10,20],[3,21,10,88],[3,89,10,97],[3,98,10,136],[13,95,16,100],[13,101,16,108],[39,79,44,120],[40,63,43,78],[40,122,43,125],[68,85,78,89],[57,85,67,89],[57,124,67,136],[66,3,72,16],[79,85,88,97],[79,98,88,110],[79,111,88,123],[79,124,88,136],[89,9,96,16],[89,17,96,30],[89,31,96,44],[89,45,96,58],[89,59,96,71],[89,72,96,84],[79,72,88,84],[79,17,88,30],[79,31,88,44],[79,45,88,58],[79,59,88,71],[66,46,72,51],[66,52,72,58],[68,66,78,71],[68,72,78,77],[68,78,78,84],[89,85,96,97],[89,98,96,110],[89,111,96,123],[89,124,96,136],[97,9,104,16],[97,17,104,30],[97,31,104,44],[97,45,104,58],[97,59,104,71],[125,17,130,30],[125,31,130,44],[125,45,130,58],[97,124,104,136],[105,9,112,16],[105,17,112,30],[105,31,112,44],[105,45,112,58],[105,59,112,71],[97,72,104,84],[97,85,104,97],[97,98,104,110],[97,111,104,123],[113,59,118,136],[119,9,124,16],[119,17,124,30],[119,31,124,44],[119,45,124,58],[119,59,124,136],[105,72,112,84],[105,85,112,97],[105,98,112,110],[105,111,112,123],[105,124,112,136],[131,17,136,30],[131,31,136,44],[131,45,136,58],[131,59,136,136],[177,3,196,16],[177,17,196,136],[137,3,146,16],[137,17,146,136],[147,3,166,16],[147,17,166,136],[167,3,176,16],[167,17,176,25],[167,26,176,29],[167,30,176,37],[167,38,176,41],[167,42,176,53],[167,77,176,87],[170,88,173,133],[113,3,136,8],[113,9,118,16],[113,17,118,30],[113,31,118,44],[113,45,118,58],[125,9,130,16],[342,12,345,66],[0,3,0,136],[1,77,1,118],[204,3,215,10],[204,11,215,18],[204,19,215,26],[204,27,215,34],[204,35,215,42],[211,65,215,136],[197,66,203,82],[197,83,203,129],[197,130,203,136],[200,3,203,10],[200,11,203,18],[200,19,203,26],[200,27,203,34],[200,35,203,42],[200,43,215,51],[200,52,215,60],[167,54,176,63],[167,64,176,76],[167,134,176,136],[125,59,130,136],[131,9,136,16]]}
[null,null,null,"推薦書印刷データ",null,null,null,null,null,null,null,null,null,null,null,null,null,null,null,null,null,null,null,null,null,null,null,null,null,null,null,null,null,null,null,null,null,null,null,null,null,null,null,null,null,null,null,null,null,null,null,null,null,null,null,null,null,null,null,null,null,null,null,null,null,null,null,null,null,null,null,null,null,null,null,null,null,null,null,null,null,null,null,null,null,null,null,null,null,null,null,null,null,null,null,null,null,null,null,null,null,null,null,null,null,null,null,null,null,null,null,null,null,null,null,null,null,null,null,null,null,null,null,null,null,null,null,null,null,null,null,null,null,null,null,null,null,null,null,null,"表示番号"]
[null,null,null,null,null,null,null,null,null,null,null,null,null,null,null,null,null,null,null,null,null,null,null,null,null,null,null,null,null,null,null,null,null,null,null,null,null,null,null,null,null,null,null,null,null,null,null,null,null,null,null,null,null,null,null,null,null,null,null,null,null,null,null,null,null,null,null,null,null,null,null,null,null,null,null,null,null,{"$f":"IF(OR(①中学校名!D13=①中学校名!J12,①中学校名!D13=①中学校名!J14),①中学校名!K12,①中学校名!K13)","v":"（中学校用）"},null,null,null,null,null,null,null,null,null,null,null,null,null,null,null,null,null,null,null,null,null,null,null,null,null,null,null,null,null,null,null,null,null,null,null,null,null,null,null,null,null,"推",null,null,null,null,null,null,null,null,null,null,null,null,null,null,null,null,null,null,null,null,1]
[]
[null,null,null,"令和8年度",null,null,null,null,null,null,null,null,null,null,null,null,null,null,null,null,null,"鹿児島県私立高等学校統一推薦書",null,null,null,null,null,null,null,null,null,null,null,null,null,null,null,null,null,null,null,null,null,null,null,null,null,null,null,null,null,null,null,null,null,null,null,null,null,null,null,null,null,null,null,null,null,null,null,null,null,null,null,null,null,null,null,null,null,null,null,null,null,null,null,null,null,null,null,"受験\n番号",null,null,null,null,null,null,null,null,"※"]
[]
[null,null,null,null,null,null,null,null,null,null,null,null,null,null,null,null,null,null,null,null,null,null,null,null,null,null,null,null,null,null,null,null,null,null,null,null,null,null,null,null,null,null,null,null,null,null,null,null,null,null,null,null,null,null,null,null,null,null,null,null,null,null,null,null,null,null,null,null,null,null,null,null,null,null,null,null,null,null,null,null,null,null,null,null,null,null,null,null,null,null,null,null,null,null,null,null,null,null,null,null,null,null,null,null,null,null,null,null,null,null,null,null,null,null,null,null,null,null,null,null,null,null,null,null,null,null,null,null,null,null,null,null,null,null,null,null,null,null,null,null,null,"開始No",1]
[]
[]
[]
[]
[null,null,null,null,null,null,null,null,null,null,null,null,null,null,null,null,null,null,null,null,null,null,null,null,null,null,null,null,null,null,null,null,null,null,null,null,null,null,null,null,null,null,null,null,null,null,null,null,null,null,null,null,null,null,null,null,null,null,null,null,null,null,null,null,null,null,null,null,null,null,null,null,null,null,null,null,null,null,null,null,null,null,null,null,null,null,null,null,null,null,null,null,null,null,null,null,null,null,null,null,null,null,null,null,null,null,null,null,null,null,null,null,null,null,null,null,null,null,null,null,null,null,null,null,null,null,null,null,null,null,null,null,null,null,null,null,null,null,null,null,null,"終了No",{"$f":"COUNT(②氏名・生年月日・入卒!AA6:AA1500)","v":0}]
[null,"①中学校名"]
[]
[null,null,null,null,null,null,null,null,null,null,null,null,null,null,null,null,null,null,null,null,null,null,null,null,null,null,null,null,null,null,null,null,null,null,null,null,null,null,null,null,null,null,null,null,null,null,null,null,null,null,null,null,null,null,null,null,null,null,null,null,null,null,null,null,null,null,null,null,null,null,null,null,null,null,null,null,null,null,null,null,null,null,null,null,null,null,null,null,null,null,null,null,null,null,null,"令和",null,null,null,null,null,{"$f":"①中学校名!D5","v":0},null,null,null,null,null,null,null,"年",null,null,null,{"$f":"①中学校名!E5","v":0},null,null,null,null,null,null,null,"月",null,null,null,{"$f":"①中学校名!F5","v":0},null,null,null,null,null,null,null,"日"]
[]
[null,null,null,null,null,null,null,null,null,null,null,null,null,null,null,null,null,null,null,null,null,null,null,null,null,null,null,null,null,null,null,null,null,null,null,null,null,null,null,null,null,null,null,null,null,null,null,null,null,null,null,null,null,null,null,null,null,null,null,null,null,null,null,null,null,null,null,null,null,null,null,null,null,null,null,null,null,null,null,null,null,null,null,null,null,null,null,null,null,null,null,null,null,null,null,null,null,null,null,null,null,null,null,null,null,null,null,null,null,null,null,null,null,null,null,null,null,null,null,null,null,null,null,null,null,null,null,null,null,null,null,null,null,null,null,null,null,null,null,null,null,"合計",{"$f":"EM11-EM6+1 & \"人分\"","v":"0人分"}]
[]
[]
[]
[]
{"$rows_left_out":192}